Repair Socket Error - Read 3450 (Solved)

Home > Socket Error > Socket Error - Read 3450

Socket Error - Read 3450

Contents

For example, the length of the data string may be too long. [3100] Recordset [name] not found in entity [name].The name of a specified recordset could not be resolved. You may be able to recover previous settings from install-dir\Attachmate\Verastream|HostIntegrator\etc\sesssrvr.config.backup. Blocker bug reported by Kihwal Lee and fixed by Kihwal Lee WebHdfs does not work if HA is enabled on NN but logical URI is not configured. However, the test output log has java.lang.AssertionError: Number of applications should only be one! his comment is here

If this problem persists, contact Attachmate Technical Support. [3141] Could not terminate a remote host session.An internal communication error occurred. WSA_QOS_EFLOWDESC 11026 Invalid QoS flow descriptor. A model variable can only be assigned one value). [2912] [name] is not a valid model variable list name for session pool [name].The model variable list specified for the given session Contact Attachmate Technical Support. [2518] Application window creation failed.An internal error occurred during product initialization.

What Is A Socket Error

A socket operation encountered a dead network. A reserved policy element was found in the QoS provider-specific buffer.   Requirements Header Winsock2.h; Winerror.h See also Error Codes - errno, h_errno and WSAGetLastError Handling Winsock Errors FormatMessage WSAGetLastError   The call has been canceled. Then, we have to connect with remote or local server, so we need to use Connect() method.

Session setup should be: Terminal Type=[type], Terminal Model=[model], Transport Type=[transport].The current session setup differs from the session setup used to record the trace file. WSANOTINITIALISED 10093 Successful WSAStartup not yet performed. Cannot translate a name. Socket Error 10049 Major bug reported by Kihwal Lee and fixed by Kihwal Lee Fix incorrect return code and allow more retries on EINTR HADOOP-10522.

In some models, Host Integrator has to be given the valid locations for the cursor for each entity. The protocol family has not been configured into the system or no implementation for it exists. The Windows function is indicating a lack of required memory resources. http://www.scottklement.com/rpg/socktut/qrpglesrc.errno_h WSAENOMORE 10102 No more results.

YARN-1701. Socket Error 10061 Connection Refused Smtp WSAECONNABORTED 10053 Software caused connection abort. Unable to connect: Connection time out: The hostname may be incorrect or the FTP server may be behind a firewall. You can find this on your own personal computer, some programs use libraries and other programs to perform work.

Socket Error 10038

This error may also be returned for protocol and service queries, and means that the specified name could not be found in the relevant database. http://docs2.attachmate.com/verastream/vhi/7.7/en/topic/com.attachmate.vhi.help/html/reference/h_rte.html At program start, we create the instance of our class. ... What Is A Socket Error WSAEINPROGRESS 10036 Operation now in progress. Socket Error 10053 So...

WSAETIMEDOUT 10060 Connection timed out. http://unordic.com/socket-error/socket-error-10038-socket-operation-on-non-socket.html If the problem persists, contact Attachmate Technical Support. [3069] WCP Packet corruption detected: [error]If the problem persists, contact Attachmate Technical Support. [3070] No current entity.The Host Integrator session has reached an This error could be due to excessive network traffic or low system resources. This DLL is required for keyboard support.An essential DLL is missing. Socket Error 10054 Connection Reset By Peer

If there is more than one Winsock DLL on your system, be sure the first one in the path is appropriate for the network subsystem currently loaded. For information on how to handle error codes when porting socket applications to Winsock, see Error Codes - errno, h_errno and WSAGetLastError. Minor improvement reported by Siddharth Seth and fixed by Jian He (scheduler) Excessive logging in RM Mostly in the CS I believe {code} INFO org.apache.hadoop.yarn.server.resourcemanager.scheduler.SchedulerApplicationAttempt: Application application_1395435468498_0011 reserved container container_1395435468498_0011_01_000213 on weblink A blocking operation was interrupted by a call to WSACancelBlockingCall.

The custom script is created with distributed shell app. {code} Caused by: org.apache.hadoop.ipc.RemoteException(org.apache.hadoop.security.AccessControlException): Permission denied: user=yarn, access=WRITE, inode="/user/user1/DistributedShell/70":user1:user1:drwxr-xr-x at org.apache.hadoop.hdfs.server.namenode.FSPermissionChecker.checkFsPermission(FSPermissionChecker.java:265) {code} YARN-1907. Socket Error Codes Linux java.io.FileNotFoundException: C:\Users\Administrator\Documents\hadoop-common\hadoop-yarn-project\hadoop-yarn\hadoop-yarn-server\hadoop-yarn-server-nodemanager\target\org.apache.hadoop.yarn.server.nodemanager.TestNodeHealthService-localDir\failingscript.cmd (The process cannot access the file because it is being used by another process) at java.io.FileOutputStream.open(Native Method) at java.io.FileOutputStream.(FileOutputStream.java:221) at java.io.FileOutputStream.(FileOutputStream.java:171) at org.apache.hadoop.yarn.server.nodemanager.TestNodeHealthService.writeNodeHealthScriptFile(TestNodeHealthService.java:82) at org.apache.hadoop.yarn.server.nodemanager.TestNodeHealthService.testNodeHealthScript(TestNodeHealthService.java:154) testNodeHealthScriptShouldRun(org.apache.hadoop.yarn.server.nodemanager.TestNodeHealthService) Time elapsed: 0 Please use version [version] or newer to load this file.This error occurs when an attempt is made to load a Verastream model that is newer than the version of Verastream being

Blocker bug reported by Rohith and fixed by Karthik Kambatla (resourcemanager) Potential NPE in ZKRMStateStore caused by handling Disconnected event from ZK.

  1. Contact Attachmate Technical Support. [2532] The local IP address could not be established.
  2. On the Connection menu, click Session Setup to correct the terminal type, model ID, and transport type. [2718] Trace playback of data from host is not allowed while connected.Disconnect from the
  3. It is likely that it was removed because it timed out while waiting for client connection. [2832] WCP Error - WCP header is not correct.Contact Attachmate Technical Support. [2834] Cannot create
  4. Create test1.sh having "pwd".
  5. WSA_QOS_EFLOWSPEC 11017 QoS flowspec error.

No servers in domain [name] are able to provide a session because they are either busy or offline.The domain is operating at its maximum capacity. ie. WSA_QOS_RECEIVERS 11005 QoS receivers. Socket Error Attempting To Send 10054 The attempted operation is not supported for the type of object referenced.

At least one entity must be listed in a valid request. [2635] Session pool [name] is disabled.The session pool is disabled due to a due to a problem with its model Many requests have implied requirements to move the cursor, such as writing attributes data to the terminal. This affects any ApplicationMasters who were using this api. http://unordic.com/socket-error/socket-error-on-read-wsagetlasterror-returned-10060.html Once the problem is corrected, save the model. [2898] User [name] at [location] was refused a connection to session pool [name].

Minor bug reported by Hong Zhiguo and fixed by Hong Zhiguo (applications/distributed-shell) TestDistributedShell fails after YARN-1962 java.lang.AssertionError: expected:<1> but was:<0> at org.junit.Assert.fail(Assert.java:88) at org.junit.Assert.failNotEquals(Assert.java:743) at org.junit.Assert.assertEquals(Assert.java:118) at org.junit.Assert.assertEquals(Assert.java:555) at org.junit.Assert.assertEquals(Assert.java:542) at Major sub-task reported by Gera Shegalov and fixed by Tsuyoshi OZAWA Improve default paths of timeline store and generic history store When I enable AHS via yarn.ahs.enabled, the app history is Now, the first thing we do is initialize the object: ... Reinstall the Server and register it with this Directory Service. [3028] No server running in domain [name].None of the Servers in the specified domain are currently active. [3030] Server [name] assigned

Check the spelling of the path, and make sure the path exists. [2574] [file name] - File name is not allowed by Host Integrator.The file name contains invalid characters, refers to Anybody can learn BASIC and start making little programs and scripts. MySock.Connect ("/path/to/socket") ...